[Padre-dev] Fail to install Padre 0.26, MS-Windows, ActivePerl 5.10.0 Build 1004

Oren Maurer meorero at gmail.com
Mon Feb 9 01:33:58 PST 2009


Links to http://padre.perlide.org/
??
Sure! .

On Mon, Feb 9, 2009 at 11:28 AM, Gabor Szabo <szabgab at gmail.com> wrote:

> it has been fixed in trunk alrady
> I should release it ASAP.
>
> btw its great you are blogging about padre.
> Can I ask you to write your links to "Padre, the Perl IDE"
> to get more search engine karma.
>
>
> Gabor
>
> 2009/2/9 Oren Maurer <meorero at gmail.com>:
> > Something about "docbrowser" maybe? Is it a part of Padre, or out of
> Padre?
> >
> >
> > Here's the installation code lines around the error:
> >
> >
> > Microsoft (R) Program Maintenance Utility   Version 1.50
> > Copyright (c) Microsoft Corp 1988-94. All rights reserved.
> >
> >         C:\Perl\bin\perl.exe "-MExtUtils::Command::MM" "-e"
> "test_harness(0,
> > 'in
> > c', 'blib\lib', 'blib\arch')" t/*.t
> > t/00-compile...........ok
> > t/01-load..............ok 2/23# Tests find Wx: 0.87 wxWidgets 2.8.9
> > t/01-load..............ok
> > t/02-new...............ok
> > t/03-wx................skipped
> >         all skipped: Windows currently has problems with Unicode files
> > t/04_config............ok
> > t/10-copyright.........ok
> > t/50-docbrowser........
> > t/50-docbrowser........NOK 1/0#   Failed test 'use Padre::DocBrowser;'
> > #   at t/50-docbrowser.t line 18.
> > #     Tried to use 'Padre::DocBrowser'.
> > #     Error:  Cannot create config dir 'C:\Documents and
> > Settings\orenm\Local Se
> > ttings\Application Data\Perl\Padre' No such file or directory at
> > C:\Perl\cpan\bu
> > ild\Padre-0.26-3OuppX\blib\lib/Padre/Config.pm line 415.
> > # BEGIN failed--compilation aborted at
> > C:\Perl\cpan\build\Padre-0.26-3OuppX\blib
> > \lib/Padre/DB.pm line 22.
> > # Compilation failed in require at
> > C:\Perl\cpan\build\Padre-0.26-3OuppX\blib\lib
> > /Padre.pm line 32.
> > # BEGIN failed--compilation aborted at
> > C:\Perl\cpan\build\Padre-0.26-3OuppX\blib
> > \lib/Padre.pm line 32.
> > # Compilation failed in require at
> > C:\Perl\cpan\build\Padre-0.26-3OuppX\blib\lib
> > /Padre/Document.pm line 54.
> > # BEGIN failed--compilation aborted at
> > C:\Perl\cpan\build\Padre-0.26-3OuppX\blib
> > \lib/Padre/Document.pm line 54.
> > # Compilation failed in require at
> > C:\Perl\cpan\build\Padre-0.26-3OuppX\blib\lib
> > /Padre/DocBrowser/POD.pm line 10.
> > # BEGIN failed--compilation aborted at
> > C:\Perl\cpan\build\Padre-0.26-3OuppX\blib
> > \lib/Padre/DocBrowser/POD.pm line 10.
> > # Compilation failed in require at
> > C:\Perl\cpan\build\Padre-0.26-3OuppX\blib\lib
> > /Padre/DocBrowser.pm line 9.
> > # BEGIN failed--compilation aborted at
> > C:\Perl\cpan\build\Padre-0.26-3OuppX\blib
> > \lib/Padre/DocBrowser.pm line 9.
> > # Compilation failed in require at (eval 10) line 2.
> > # BEGIN failed--compilation aborted at (eval 10) line 2.
> >
> > t/50-docbrowser........NOK 2/0#   Failed test 'use
> Padre::Task::DocBrowser;'
> > #   at t/50-docbrowser.t line 19.
> > #     Tried to use 'Padre::Task::DocBrowser'.
> > #     Error:  Attempt to reload Padre/DocBrowser.pm aborted.
> > # Compilation failed in require at
> > C:\Perl\cpan\build\Padre-0.26-3OuppX\blib\lib
> > /Padre/Task/DocBrowser.pm line 5.
> > # BEGIN failed--compilation aborted at
> > C:\Perl\cpan\build\Padre-0.26-3OuppX\blib
> > \lib/Padre/Task/DocBrowser.pm line 5.
> > # Compilation failed in require at (eval 94) line 2.
> > # BEGIN failed--compilation aborted at (eval 94) line 2.
> > Can't locate object method "new" via package "Padre::DocBrowser" at
> > t/50-docbrow
> > ser.t line 21.
> > # Looks like you failed 2 tests of 3.
> > t/50-docbrowser........ok 3/0# Looks like your test exited with 255 just
> > after 3
> > .
> > t/50-docbrowser........dubious
> >         Test returned status 255 (wstat 65280, 0xff00)
> > DIED. FAILED tests 1-2
> >         Failed 2/3 tests, 33.33% okay
> > t/60-db................ok
> > t/70-document..........ok
> > t/71-perl..............skipped
> >         all skipped: Fails for unknown reasons, skipping for release
> > t/72-dialog-html.......ok
> > t/75-perl-beginner.....ok
> > t/80-newline...........ok
> > t/81-search............ok
> > t/82-plugin-manager....ok
> > t/83-autosave..........ok
> > t/84-task..............Cannot create config dir 'C:\Documents and
> > Settings\orenm
> > \Local Settings\Application Data\Perl\Padre' No such file or directory at
> > C:\Per
> > l\cpan\build\Padre-0.26-3OuppX\blib\lib/Padre/Config.pm line 415.
> > BEGIN failed--compilation aborted at
> > C:\Perl\cpan\build\Padre-0.26-3OuppX\blib\l
> > ib/Padre/DB.pm line 22.
> > Compilation failed in require at
> > C:\Perl\cpan\build\Padre-0.26-3OuppX\blib\lib/P
> > adre.pm line 32.
> > BEGIN failed--compilation aborted at
> > C:\Perl\cpan\build\Padre-0.26-3OuppX\blib\l
> > ib/Padre.pm line 32.
> > Compilation failed in require at
> > C:\Perl\cpan\build\Padre-0.26-3OuppX\blib\lib/P
> > adre/Task.pm line 8.
> > Compilation failed in require at t/84-task.t line 12.
> > BEGIN failed--compilation aborted at t/84-task.t line 12.
> > t/84-task..............dubious
> >         Test returned status 2 (wstat 512, 0x200)
> > DIED. FAILED tests 1-50
> >         Failed 50/50 tests, 0.00% okay
> > t/85-task-manager......skipped
> >         all skipped: Fails for unknown reasons, skipping till tsee fixes
> it
> > t/91-vi................# Testing the t::lib::Padre::Editor a bit
> > t/91-vi................ok
> > Failed Test       Stat Wstat Total Fail  List of Failed
> >
> -------------------------------------------------------------------------------
> > t/50-docbrowser.t  255 65280     3    2  1-2
> > t/84-task.t          2   512    50  100  1-50
> > 3 tests skipped.
> > Failed 2/19 test scripts. 52/655 subtests failed.
> > Files=19, Tests=655, 140 wallclock secs ( 0.00 cusr +  0.00 csys =  0.00
> > CPU)
> > Failed 2/19 test programs. 52/655 subtests failed.
> > NMAKE : fatal error U1077: 'C:\WINDOWS\system32\cmd.exe' : return code
> > '0xff'
> > Stop.
> >   JQUELIN/Padre-0.26.tar.gz
> >   C:\Perl\bin\nmake.EXE test -- NOT OK
> > //hint// to see the cpan-testers results for installing this module, try:
> >   reports JQUELIN/Padre-0.26.tar.gz
> > Running make install
> >   make test had returned bad status, won't install without force
> > Failed during this command:
> >  MBARBON/Wx-0.89.tar.gz                       : writemakefile NO
> > 'C:\Perl\bin\pe
> > rl.exe Makefile.PL INSTALLDIRS=site' returned status 512
> >  JQUELIN/Padre-0.26.tar.gz                    : make_test NO
> >
> >
> > cpan[2]>
> >
> _______________________________________________
> Padre-dev mailing list
> Padre-dev at perlide.org
> http://mail.perlide.org/mailman/listinfo/padre-dev
>



-- 
________________________________
Oren  Maurer
http://meorero.wordpress.com
http://www.meorero.org.il
_______________________________
#  =======================|
#  Please avoid sending me Word |
#   or PowerPoint attachments      |
#  =======================|
# See: http://www.gnu.org/philosophy/no-word-attachments.html
-------------- next part --------------
An HTML attachment was scrubbed...
URL: http://mail.perlide.org/pipermail/padre-dev/attachments/20090209/89f05bcc/attachment.htm 


More information about the Padre-dev mailing list